Vocabulary of work types
type: ConceptScheme
label: Vokabular for verkstypar @nn
label: Vokabular for verkstyper @nb

Work of performing arts
type: Concept
name: PerformingArt
example: Teaterframsyninga "Natten er dagens mor" produsert av Nationaltheatret for Hovedscenen. Premiere: 10. januar 2015 @nn
example: The theatrical performance "Natten er dagens mor" produced by Nationaltheatret for Hovedscenen. Premiere: 10. January 2015
example: Teaterforestillingen "Natten er dagens mor" produsert av Nationaltheatret for Hovedscenen. Premiere: 10. januar 2015 @nb
in scheme: Vocabulary of work types
preferred label: Framføringsverk @nb
scope note: Including, but not limited to, theatrical performances, dramatized music (for example opera, oratorio and musical performances), and dance
scope note: Inkluderer, men ikke begrenset til, teaterforestillinger, dramatisert musikk (for eksempel opera-, oratorie- og musikalfremføringer), og dans @nb
scope note: Inkluderer, men ikkje avgrensa til, teaterframsyningar, dramatisert musikk (for eksempel opera-, oratorie- og musikalframsyningar), og dans @nn
definition: Works expressed as a creative activity that is performed in front of an audience
definition: Verk som er uttrykt som en kreativ aktivitet framført foran et publikum @nb
definition: Verk som er uttrykt som ein kreativ aktivitet framført framfor eit publikum @nn