Norsk tesaurus for sjanger og form
preferred label: Norwegian thesaurus on genre and form @en
type: ConceptScheme

Thrillere
example: Presidenten er savnet / Bill Clinton.
example: Alt er mitt / Ruth Lillegraven.
definition: En thriller er en spennende historie om store problemer, hvor hovedpersonen som regel havner i fare, og må redde situasjonen før det er for sent [Sølvberget].
scope note: Brukes for spennende skjønnlitteratur, hvor fokuset ikke nødvendigvis er på å oppklare en forbrytelse. Ofte med innslag av psykisk terror, kan også være spionthrillere eller politiske thrillere.
narrower: Psykologiske thrillere
preferred label: Thrillerar @nn
preferred label: Thrillers (fiction) @en
in scheme: Norsk tesaurus for sjanger og form
broader: Krim og spenning
modified: 2021-02-15T16:49:04
created: 2019-03-06T12:20:31
type: Concept

Psykologiske thrillere
preferred label: Psykologiske thrillerar @nn
preferred label: Psychological thrillers @en
type: Concept
broader: Thrillere

Krim og spenning
preferred label: Crime and thriller fiction @en
type: Concept
narrower: Thrillere