Norsk tesaurus for sjanger og form
preferred label: Norwegian thesaurus on genre and form @en
type: ConceptScheme

Interfolierte bøker
definition: Bildebøker med punktskrift for blinde voksne og seende barn. Bildebøkene er splittet opp og sydd sammen igjen med folieark mellom. På de gjennomsiktige foliearkene er det punktskrift, slik at blinde kan lese punktskrift mens barnet ser på bildene [red.]. @nb
scope note: Ei interfoliert bok er en vanlig bildebok som har gjennomsiktige folieark med punktskrift mellom boksidene. @nb
preferred label: Interleaved books @en
in scheme: Norsk tesaurus for sjanger og form
broader: Taktile verk
modified: 2025-06-27T16:41:54
created: 2025-06-13T06:20:00
type: Concept

Taktile verk
preferred label: Tactile works @en
type: Concept
narrower: Interfolierte bøker