Norsk tesaurus for sjanger og form
preferred label: Norwegian thesaurus on genre and form @en
type: ConceptScheme

Veiledere
example: Sakskostnader : en veileder basert på Sivilombudets uttalelser om sakskostnader.
example: Nasjonale faglige retningslinjer for antibiotikabruk i primærhelsetjenesten.
example: Hus for storfe : norske anbefalinger / tekst: Lars Erik Ruud (red.), Åse Margrethe Sogstad, Lars Erik Heggen.
definition: En veileder gir råd, støtte eller praktisk hjelp for å løse en oppgave eller oppnå et mål [Kudos].
scope note: Brukes både for veiledere og for retningslinjer (formelle instruksjoner eller regler).
alternative label: Retningslinjer
alternative label: General requirements @en
preferred label: Rettleiarar @nn
preferred label: Guidelines @en
in scheme: Norsk tesaurus for sjanger og form
broader: Informative verk
modified: 2024-10-02T07:57:45
created: 2024-09-18T11:19:12
type: Concept

Informative verk
preferred label: Informational works @en
type: Concept
narrower: Veiledere