Norsk tesaurus for sjanger og form
preferred label: Norwegian thesaurus on genre and form @en
type: ConceptScheme

Children's books
example: Henrik og badesvampen. https://www.nb.no/items/URN:NBN:no-nb_digibok_2012052305053
example: Lommebog for Børn.
definition: Tekster skrevet av voksne for å bli lest av eller for barn. Mer enn bare en målgruppe: «Barneperspektivet og det aktive barnet er hovedelement i barnelitteraturen» [SNL].
scope note: Termen blir brukt særlig i Nasjonalbibliotekets spesialbibliografier for eldre barnelitteratur som forskningsobjekt, og i Ibsenbibliografien på Ibsenrelatrert stoff rettet mot barn. Som oftest ikke brukt på moderne, ordinære barnebøker.
alternative label: Barnebok
alternative label: Barnelitteratur
preferred label: Barnebøker
in scheme: Norsk tesaurus for sjanger og form
broader: Literature
modified: 2026-08-10T06:00:14
created: 2023-06-20T10:13:28
type: Concept

Literature
preferred label: Litteratur
type: Concept
narrower: Children's books