Norsk tesaurus for sjanger og form
preferred label: Norwegian thesaurus on genre and form @en
type: ConceptScheme

Magistergradsavhandlinger
example: Zwischen Enttäuschung, Patriotismus und Glaube : Motive und Argumente der Auswanderungsgegner in Norwegen von Ende der 1830er Jahre bis 1914 / Jeannette Woermann. Magistergradsavhandling - Universität zu Köln, 2007. [kilde: Norsk-amerikansk bibliografi].
definition: [Avhandling avgitt til magistergraden], akademisk grad på nivå mellom kandidatgrad og doktorgrad oppnådd bl.a. på grunnlag av en vitenskapelig avhandling [NAOB]. Brukt i Norge i perioden 1921-2003.
alternative label: Magisteroppgaver
preferred label: Magistergradsavhandlingar @nn
preferred label: Magister degrees @en
in scheme: Norsk tesaurus for sjanger og form
broader: Avhandlinger
modified: 2026-08-01T06:00:09
created: 2019-03-06T12:20:30
type: Concept

Avhandlinger
preferred label: Avhandlingar @nn
preferred label: Academic thesis @en
type: Concept
narrower: Magistergradsavhandlinger