Norsk tesaurus for sjanger og form
preferred label: Norwegian thesaurus on genre and form @en
type: ConceptScheme

Pamfletter
example: Som man raaber i Skoven, faaer man Svar, eller aftvunget Forsvar i Anledning af en anonym Forfatters Critik over min Afhandling om Norges Odelsret / af Amtmand Falsen, 1815. https://www.nb.no/bibliografi/1814/show?id=4d8126a6f5297646edc0f97f4ef2f91f&bibliography=bib1814.
example: Letter from Sir Philip Francis, knight of the most honourable order of the Bath, to Earl Grey : on the policy of Great Britain and the Allies towards Norway, 1814. https://www.nb.no/bibliografi/1814/show?id=30f29083b71c5d3faf2ab8541d84d534&bibliography=bib1814.
definition: Liten trykksak, ofte med kritisk, satirisk innhold (NAOB).
scope note: Kortfattet uinnbundet publikasjon/trykk/trykksak om et aktuelt tema, ofte av politisk, religiøs eller moralsk karakter, gjerne holdt i en kritisk og polemisk stil.
preferred label: Pamflettar @nn
preferred label: Pamphlets @en
in scheme: Norsk tesaurus for sjanger og form
broader: Brosjyrer
modified: 2026-08-10T06:00:14
created: 2022-11-15T09:41:28
type: Concept

Brosjyrer
preferred label: Brochures @en
type: Concept
narrower: Pamfletter