Norsk tesaurus for sjanger og form
preferred label: Norwegian thesaurus on genre and form @en
type: ConceptScheme

Statskalendere
example: Suomen valtiokalenteri = Finlands statskalender.
example: Norges statskalender : fortegnelse over konstitusjonelle organer og statsforvaltning m.v. = Norwegian government yearbook.
definition: Norges statskalender var en fortegnelse over konstitusjonelle organer og statsforvaltning som ble utgitt årlig i perioden 1815-2011. Statskalenderen inneholdt en komplett oversikt over statsinstitusjoner med opplysninger om antall ansatte, virksomhetsområder, organisering, budsjetter, ansvars- og arbeidsområde. Den hadde også oversikt over ansatte (med personalia), adresser og telefonnumre. Videre inneholdt den oppdatert oversikt over Stortingets sammensetning, regjeringen og kongehuset. Norges statskalender ble etter vedtak av Fornyings- administrasjon og kirkedepartementet nedlagt med virkning fra 1. januar 2012 [SNL].
alternative label: Statskalender
alternative label: Government yearbooks @en
preferred label: State calendars @en
preferred label: Statskalendrar @nn
in scheme: Norsk tesaurus for sjanger og form
broader: Yearbooks
modified: 2026-08-01T06:00:09
created: 2022-10-19T08:50:05
type: Concept

Yearbooks
preferred label: Årbøker
type: Concept
narrower: Statskalendere