Norsk tesaurus for sjanger og form
preferred label: Norwegian thesaurus on genre and form @en
type: ConceptScheme

Vitenskapelige artikler
example: Utprøving av en tilpasset gruppebehandling for unge voksne. https://psykologtidsskriftet.no/originalartikkel/2021/06/utproving-av-en-tilpasset-gruppebehandling-unge-voksne
example: Fatal hjerneblødning etter covid-19-vaksine. https://tidsskriftet.no/2021/04/kort-kasuistikk/fatal-hjerneblodning-etter-covid-19-vaksine
definition: En vitenskapelig artikkel (også kalt forkningsartikkel eller fagfellevurdert artikkel) er basert på forskning, og formålet med artikkelen er at en skal presentere ny forskning og gi ny innsikt i faglige problemstillinger [Nord universitet].
alternative label: Vitenskapelig artikkel
alternative label: Forskningsartikler
alternative label: Forskningsartikkel
alternative label: Fagfellevurderte artikler
preferred label: Vitskaplege artiklar @nn
preferred label: Peer reviewed articles @en
in scheme: Norsk tesaurus for sjanger og form
broader: Deler av bøker, aviser og tidsskrift
modified: 2026-07-31T06:00:08
created: 2021-10-19T13:38:35
type: Concept

Deler av bøker, aviser og tidsskrift
preferred label: Delar av bøker, aviser, tidsskrift @nn
preferred label: Parts of books, newspapers and journals @en
type: Concept
narrower: Vitenskapelige artikler