Norsk tesaurus for sjanger og form
preferred label: Norwegian thesaurus on genre and form @en
type: ConceptScheme

Grunnlover
type: Concept
created: 2019-03-06T12:20:30
modified: 2026-08-01T06:00:09
broader: Juridisk materiale
in scheme: Norsk tesaurus for sjanger og form
preferred label: Constitutions @en
preferred label: Grunnlovar @nn
alternative label: Konstitusjoner
alternative label: State constitutions @en
alternative label: Forfatninger
alternative label: Statsforfatninger
scope note: Brukes f.eks. på Norges grunnlov.
definition: Grunnlov er en lov som inneholder grunnleggende regler om et lands statsform og politiske system og regulerer særlig viktige sider ved hvordan det politiske systemet fungerer [SNL].
example: Kongeriget Norges Grundlov.
example: Kongeriget Norges grundlov af 17de mai 1814. [kilde: 1814-bibliografi].

Juridisk materiale
preferred label: Law materials @en
type: Concept
narrower: Grunnlover