Norsk tesaurus for sjanger og form
type: ConceptScheme
preferred label: Norwegian thesaurus on genre and form @en

Laboratoriehåndbøker
type: Concept
example: Microbiology : a laboratory manual.
definition: En oppgavebok med instrukser til laboratorieeksperimenter. Den blir ofte utgitt i forbindelse med en tekstbok [UBO].
alternative label: Laboratoriemanualar @nn
alternative label: Laboratoriemanualer
preferred label: Laboratoriehandbøker @nn
preferred label: Laboratory manuals @en
in scheme: Norsk tesaurus for sjanger og form
broader: Håndbøker
created: 2023-09-06T11:52:56

Håndbøker
type: Concept
preferred label: Handbøker @nn
preferred label: Handbooks and manuals @en
narrower: Laboratoriehåndbøker