Norsk tesaurus for sjanger og form
type: ConceptScheme
preferred label: Norwegian thesaurus on genre and form @en

Ekskursjonsguider
type: Concept
example: Excursion guide : tours a and b to Svalbard.
definition: Bøker som beskriver et geografisk område av særlig interesse for vitenskapelig undersøkelse, for eksempel av biologisk eller geologisk art [UBO].
alternative label: Ekskursjonsførere
preferred label: Ekskursjonsguidar @nn
preferred label: Excursion guides @en
in scheme: Norsk tesaurus for sjanger og form
broader: Håndbøker
created: 2023-09-04T11:44:14

Håndbøker
type: Concept
preferred label: Handbøker @nn
preferred label: Handbooks and manuals @en
narrower: Ekskursjonsguider