Norsk tesaurus for sjanger og form
type: ConceptScheme
preferred label: Norwegian thesaurus on genre and form @en

Kirkebøker
type: Concept
example: Ministerialbok for Venabygd 1878-1898.
example: Kirkebok for Rendalen 1661-1680.
example: Kirkebok : begravelseslister : Malvik, Strinda sogneprestembete Fra 1878 til 1893.
definition: Kirkebok er embetsprotokoller ved prestekontoret som for hver menighet føres over døpte, konfirmerte, ektevidde, døde, inn- og utmeldte av kirken [SNL].
alternative label: Ministerialbøker
alternative label: Ministerialbok
alternative label: Kirkebok
alternative label: Church registers @en
preferred label: Kyrkjebøker @nn
preferred label: Parish registers @en
in scheme: Norsk tesaurus for sjanger og form
broader: Kildeskrifter
created: 2022-11-23T08:54:24

Kildeskrifter
type: Concept
preferred label: Kjeldeskrift @nn
preferred label: Sources @en
narrower: Kirkebøker