Norsk tesaurus for sjanger og form
type: ConceptScheme
preferred label: Norwegian thesaurus on genre and form @en

Eventyrfilmar
type: Concept
broad match: gf2011026005
example: Life of Pi (2012). @nb
definition: Filmsjanger som omfatter underholdende spillefilmer med eventyrlig, det vil si fantasifull og spennende, handling. Betegnelsen tilsvarer det engelske «adventure films». «Eventyrfilm» kan på norsk også brukes om filmer med handling fra folkeeventyr, men dekker bredere enn det som på norsk forståes som eventyr [Wikipedia]. @nb
preferred label: Eventyrfilmer @nb
preferred label: Adventure films @en
in scheme: Norsk tesaurus for sjanger og form
broader: Film
created: 2022-02-20T08:59:49

Film
type: Concept
preferred label: Motion pictures @en
narrower: Eventyrfilmar