Norsk tesaurus for sjanger og form
type: ConceptScheme
preferred label: Norwegian thesaurus on genre and form @en

Thrillere (film)
type: Concept
example: Runaway train (1985).
example: Insomnia (1997).
example: Bølgen (2015).
definition: Spenningsfilmer som ofte er psykologiske. Spenningen bygges gradvis opp, seeren engasjeres og identifiserer seg gjerne med hovedkarakteren. Ikke nødvendigvis en forbrytelse som skal oppklares, men et brudd på en normalsituasjon og hovedkarakterens forsøk på å gjenopprette denne [Bokbasen].
scope note: I motsetning til kriminalfilmer fokuseres det ikke oppklaring av forbrytelse, men stemningen rundt. Må ikke forveksles med sjangrene Grøssere eller Spenning.
preferred label: Thrillarar (film) @nn
preferred label: Thrillers (Motion pictures) @en
in scheme: Norsk tesaurus for sjanger og form
broader: Motion pictures
created: 2021-10-01T14:54:03

Motion pictures
type: Concept
preferred label: Film
narrower: Thrillere (film)