Norsk tesaurus for sjanger og form
type: ConceptScheme
preferred label: Norwegian thesaurus on genre and form @en

Eventyr
type: Concept
narrower: Kunsteventyr
preferred label: Fairy tales @en

Kunsteventyr
type: Concept
created: 2020-07-07T12:40:34
modified: 2026-08-01T06:00:09
broader: Eventyr
definition: Kunsteventyr er eventyr som er skrevet av en navngitt forfatter. Disse eventyrene er ofte inspirert av folkeeventyr, men de bærer preg av at de ikke har en forhistorie i muntlig form. H.C. Andersen er en kjent forfatter av kunsteventyr. I Norge er blant annet Regine Normann og Jonas Lie kjent for å ha gitt ut samlingen Trold. @nb
example: Keiserens nye klær / H.C. Andersen. @nb
in scheme: Norsk tesaurus for sjanger og form
preferred label: Art fairy tales @en