Norsk tesaurus for sjanger og form
type: ConceptScheme
preferred label: Norwegian thesaurus on genre and form @en

Folkediktning
type: Concept
narrower: Fabler
preferred label: Folk literature @en
preferred label: Folkedikting @nn

Fabler
type: Concept
created: 2019-03-06T12:20:30
modified: 2020-01-03T10:24:12
broader: Folkediktning
definition: Fabel, fra latin fabula som betyr fortelling (fra verbet fari, å fortelle) er en betegnelse for en kort fortelling med en satirisk eller moralistisk handling, ofte i form av allegorier, og ofte i form av et dyr i hovedrollen som personifikasjoner av menneskelige egenskaper, laster eller dyder. Fabelens hensikt er å være belærende og underholdende, og en sjelden gang også refsende (Wikipedia).
example: Æsops fabler.
in scheme: Norsk tesaurus for sjanger og form
preferred label: Fables @en
preferred label: Fablar @nn
scope note: Korte fortellinger med satirisk og moralsk handling, ofte med dyr i hovedrollen.