Norsk tesaurus for sjanger og form
type: ConceptScheme
preferred label: Norwegian thesaurus on genre and form @en

Taktile verk
type: Concept
narrower: Interfolierte bøker
preferred label: Tactile works @en

Interfolierte bøker
type: Concept
created: 2025-06-13T06:20:00
modified: 2025-06-27T16:41:54
broader: Taktile verk
definition: Bildebøker med punktskrift for blinde voksne og seende barn. Bildebøkene er splittet opp og sydd sammen igjen med folieark mellom. På de gjennomsiktige foliearkene er det punktskrift, slik at blinde kan lese punktskrift mens barnet ser på bildene [red.]. @nb
in scheme: Norsk tesaurus for sjanger og form
preferred label: Interleaved books @en
scope note: Ei interfoliert bok er en vanlig bildebok som har gjennomsiktige folieark med punktskrift mellom boksidene. @nb