Norsk tesaurus for sjanger og form
type: ConceptScheme
preferred label: Norwegian thesaurus on genre and form @en

Litteraturgjennomgangar
type: Concept
created: 2024-05-13T12:27:24
modified: 2024-05-31T10:03:55
broader: Informative verk
definition: En litteraturgjennomgang er i vitenskap er en skriftlig oversikt over tidligere forskning som er gjort i et fagområde (Wikipedia). @nb
example: Dangdai Zhongguo jindai shehuishi yanjiu (1949-2019) = Contemporary studies of modern Chinese social history / Li Changli, Tang Shichun, Li Junling, Lü Wenhao zhu (ISBN 9787520351591). @nb
in scheme: Norsk tesaurus for sjanger og form
preferred label: Litteraturgjennomganger @nb
preferred label: Literature reviews @en

Informative verk
type: Concept
narrower: Litteraturgjennomgangar
preferred label: Informational works @en