Norsk tesaurus for sjanger og form
type: ConceptScheme
preferred label: Norwegian thesaurus on genre and form @en

Romaner
type: Concept
narrower: Serieromaner
preferred label: Novels @en
preferred label: Romanar @nn

Serieromaner
type: Concept
created: 2019-03-06T12:20:31
modified: 2019-11-15T12:56:11
alternative label: Seriefiksjon
alternative label: Romanserier
broader: Romaner
definition: En lengre sammenhengende og avsluttet fortellende serie, som er minst 65–100 sider lang (verkets ”lengde” har også å gjøre med f.eks. antall bilder pr side, og kan derfor ikke defineres bare ved hjelp av sidetall). Begrepet omfatter ikke samlingar av episoder i en lengre løpende serie hvis disse ikke danner en større helhet som er tydelig sammenhengende og avsluttet (oversatt fra KB sjanger og formtesaurus, skjønnlitteratur).
example: Sønnavind / Frid Ingulstad.
example: Sagaen om isfolket / Margit Sandemo.
example: Morgan Kane / Louis Masterson.
in scheme: Norsk tesaurus for sjanger og form
preferred label: Serieromanar @nn
scope note: Brukes for skjønnlitteratur som utgis med en fast utgivelsesfrekvens, og med mange titler i serien. Selges ofte i kiosker og er ofte heftet.