Norsk tesaurus for sjanger og form
type: ConceptScheme
preferred label: Norwegian thesaurus on genre and form @en

Sagaer
type: Concept
created: 2019-03-06T12:20:31
modified: 2026-08-10T06:00:14
alternative label: Ættesagaer
alternative label: Kongesagaer
alternative label: Norrøn litteratur
broader: Literature
definition: Saga er en betegnelse for den islandske episke prosalitteraturen fra middelalderen. I norrøn språkbruk betyr saga både muntlig og skrevet fortelling, uten hensyn til lengde, innhold eller form; man har skjelnet mellom «sann-saga» og «lygi-saga», men grensen går ikke alltid der man nå ville sette den mellom historie og diktning. Sagaene har for det meste anonyme forfattere. Bare enkelte konge-og samtidssagaer har navngitte forfattere, for eksempel Snorre Sturlason og Sturla Tordarson (SNL).
example: Heimskringla / Snorri Sturluson.
example: Alexanders saga / Brandr Jónsson.
in scheme: Norsk tesaurus for sjanger og form
preferred label: Sagas @en

Literature
type: Concept
narrower: Sagaer
preferred label: Litteratur