Norsk tesaurus for sjanger og form
type: ConceptScheme
preferred label: Norwegian thesaurus on genre and form @en

Nautiske almanakker
type: Concept
created: 2023-09-06T13:16:52
broader: Almanakker
definition: Nautisk almanakk er et tabellverk for posisjon på forskjellige himmellegemer hver dag gjennom året. Det er utarbeidet til bruk ved astronomisk navigasjon til sjøs, og inneholder astronomiske tabeller over sol, måne, fire planeter og 57 stjerner som trengs for beregning av posisjon [SNL].
example: Norsk nautisk almanakk og sjøfartskalender.
in scheme: Norsk tesaurus for sjanger og form
preferred label: Nautical almanacs @en
preferred label: Nautiske almanakkar @nn

Almanakker
type: Concept
narrower: Nautiske almanakker
preferred label: Almanacs @en
preferred label: Almanakkar @nn