Norwegian thesaurus on genre and form
type: ConceptScheme
preferred label: Norsk tesaurus for sjanger og form @nn

Anatomy atlases
type: Concept
created: 2023-06-09T10:13:55
alternative label: Anatomical atlases
alternative label: Anatomic atlases
broader: Reference works
definition: En mer eller mindre komplett samling tegninger av anatomiske strukturer i menneskekroppen, både makroskopiske snitt og overflatestrukturer [SML/SNL]. @nb
example: Atlas of the human brain. @nb
in scheme: Norwegian thesaurus on genre and form
preferred label: Anatomiske atlas @nn

Reference works
type: Concept
narrower: Anatomy atlases
preferred label: Oppslagsverk @nn