Norsk tesaurus for sjanger og form
type: ConceptScheme
preferred label: Norwegian thesaurus on genre and form @en

Sangbøker
type: Concept
created: 2023-03-21T13:09:06
alternative label: Sangbok
alternative label: Songbooks @en
broader: Viser og sanger
definition: Bok med tekster (og noter) til sanger (til bruk ved allsang e.l.) [NAOB].
example: Osloviser (Musikk-husets forlag A/S, 2019).
example: Byen på tvers i viser og vers (Christianssands Byselskab, 2020).
in scheme: Norsk tesaurus for sjanger og form
preferred label: Songbøker @nn
preferred label: Song books @en
scope note: Sangbøker inneholder som oftest noter, men vi har allikevel valgt å ta med begrepet i denne tesaurusen.

Viser og sanger
type: Concept
narrower: Sangbøker
preferred label: Songs and Scandinavian ballads @en
preferred label: Viser og songar @nn