Norsk tesaurus for sjanger og form
type: ConceptScheme
preferred label: Norwegian thesaurus on genre and form @en

Humor
type: Concept
narrower: Parodier

Parodier
type: Concept
created: 2019-03-06T12:20:31
modified: 2020-03-23T15:34:01
broader: Humor
definition: (..) I litteraturen betegner parodi en komisk-satirisk diktning som etterligner et annet diktverk eller en gruppe diktverker ved at formen og tonen i parodien er overført på et lavt, hverdagslig eller ubetydelig innhold, f.eks. Holbergs Peder Paars, som parodierer det antikke eposet, og Wessels Kierlighed uden strømper, som parodierer de norske etterlignere av den franske klassisistiske tragedien (..) [SNL].
example: Peder Paars / Ludvig Holberg.
example: Kierlighed uden strømper / Johan Herman Wessel.
in scheme: Norsk tesaurus for sjanger og form
preferred label: Parodiar @nn
preferred label: Parodies (literature) @en