Norsk tesaurus for sjanger og form
type: ConceptScheme
preferred label: Norwegian thesaurus on genre and form @en

Forskningsrapporter
type: Concept
created: 2022-11-14T12:26:42
alternative label: Forskingsrapporter
broader: Rapporter
definition: En forskningsrapport er en publikasjon som rapporterer om funnene fra et forskningsprosjekt eller alternativt vitenskapelige observasjoner om eller om et emne [Wikipedia].
example: Når porten gjøres vid : evaluering av trosopplæringens breddetiltak.
example: Når det rokkes ved tradisjon og tilhørighet : nedgang i oppslutning om dåp i Oslo bispedømme.
example: Koreokrati : en evaluering av pilotprosjekt for utvikling av profesjonelle dansemiljøer.
in scheme: Norsk tesaurus for sjanger og form
preferred label: Forskingsrapportar @nn
preferred label: Research reports @en

Rapporter
type: Concept
narrower: Forskningsrapporter
preferred label: Rapportar @nn
preferred label: Reports @en