Neo (Norske emneord)
preferred label: Neo (Norwegian subject headings) @en
type: ConceptScheme

Englandsfarten, 1940-1942
definition: Englandsfarten eller Nordsjøfarten var båttrafikken mellom det okkuperte Norge og Storbritannia (særlig Shetland, Orknøyene og Skottland) under andre verdenskrig.
in scheme: Neo (Norske emneord)
broader: (ekspedisjoner, reiser og redningsaksjoner)
modified: 2026-08-14T20:01:25
created: 2026-08-14T18:55:52
type: Concept

(ekspedisjoner, reiser og redningsaksjoner)
type: Concept
narrower: Englandsfarten, 1940-1942