Neo (Norske emneord)
type: ConceptScheme
preferred label: Neo (Norwegian subject headings) @en

Våpenkvila, 1918
type: Concept
scope note: Våpenstillstanden i Compiègneskogen var en våpenstillstand som ble inngått den 11. november 1918 mellom ententen og Det tyske rike. Den avsluttet stridighetene på vestfronten under første verdenskrig. @nb
preferred label: Våpenhvilen, 1918 @nb
in scheme: Neo (Norske emneord)
broader: Enkeltkrigar og slag
modified: 2026-08-14T21:01:24
created: 2026-08-14T20:43:45

Enkeltkrigar og slag
type: Concept
preferred label: (enkeltkriger, krigsoperasjoner og slag) @nb
narrower: Våpenkvila, 1918