Neo (Norske emneord)
type: ConceptScheme
preferred label: Neo (Norwegian subject headings) @en

South Sea-boblen, 1720
type: Concept
scope note: South Sea Bubble var en britisk finansskandale i 1720 knyttet til South Sea Company. Voldsom spekulasjon i selskapets aksjer førte til at verdien kollapset og en mengde mennesker ble ruinert.
in scheme: Neo (Norske emneord)
broader: (katastrofer, kriser, ulykker og hungersnød)
modified: 2026-08-14T21:01:24
created: 2026-08-14T20:29:42

(katastrofer, kriser, ulykker og hungersnød)
type: Concept
preferred label: Katastrofar, krisar, ulykker og hungersnød @nn
narrower: South Sea-boblen, 1720