Neo (Norske emneord)
type: ConceptScheme
preferred label: Neo (Norwegian subject headings) @en

Lensmannsmordene, 1926
type: Concept
scope note: Lensmannsmordene på Vågård var en hendelse der to lensmenn ble myrdet på et tjenesteoppdrag den 22. august i 1926. Lensmannsmordene har blitt stående som en av de største kriminalsakene i Norge før andre verdenskrig.
in scheme: Neo (Norske emneord)
broader: (rettssaker og mediesaker)
modified: 2026-08-14T21:01:24
created: 2026-08-14T20:02:27

(rettssaker og mediesaker)
type: Concept
narrower: Lensmannsmordene, 1926