Neo (Norske emneord)
type: ConceptScheme
preferred label: Neo (Norwegian subject headings) @en

Peloponneskrigen
type: Concept
scope note: Peloponneskrigen (431–404 fvt.) var en ødeleggende konflikt mellom Athen og det athenske sjøforbundet på den ene siden, og Sparta med det peloponnesiske forbundet på den andre
in scheme: Neo (Norske emneord)
broader: (enkeltkriger, krigsoperasjoner og slag)
modified: 2026-08-14T20:01:25
created: 2026-08-14T19:35:14

(enkeltkriger, krigsoperasjoner og slag)
type: Concept
preferred label: Enkeltkrigar og slag @nn
narrower: Peloponneskrigen