Neo (Norske emneord)
type: ConceptScheme
preferred label: Neo (Norwegian subject headings) @en

1940-1949
type: Concept
narrower: 1939-1945

1939-1945
type: Concept
created: 2025-02-25T14:40:07
modified: 2025-10-26T14:00:43
broader: 1940-1949
in scheme: Neo (Norske emneord)
scope note: Her: årstall for Andre verdenskrig i Norge. Kan brukes sammen med Andre verdenskrig fra Generelle emner @nb