Norsk musikkvokabular: Instrumenter og ensembler
preferred label: Norsk musikkvokabular: Instrument og ensemble @nn
preferred label: Norwegian music vocabulary: Instruments and ensembles @en
type: ConceptScheme

Fingercymbaler
definition: Små cymbaler som festes til fingrene (som regel parvis på tommel og peke- eller langfinger). (Grove Music Online (Engelsk), 01.06.2026)
alternative label: Zill
preferred label: Fingercymbalar @nn
in scheme: Norsk musikkvokabular: Instrumenter og ensembler
broader: Cymbal
modified: 2026-08-09T06:00:06
created: 2021-10-25T11:42:47
type: Concept

Cymbal
type: Concept
narrower: Fingercymbaler