Norsk musikkvokabular: Instrument og ensemble
preferred label: Norsk musikkvokabular: Instrumenter og ensembler @nb
preferred label: Norwegian music vocabulary: Instruments and ensembles @en
type: ConceptScheme

Bassettklarinett
definition: En type klarinett hvor toneomfanget (og den fysiske lengden) er utvidet. Er vanligvis stemt i A, B eller C, og kan nå et dypere register enn sopranklarinetten. (Wikipedia (Engelsk), 22.04.2026) @nb
in scheme: Norsk musikkvokabular: Instrument og ensemble
broader: Klarinett
modified: 2026-08-09T06:00:06
created: 2026-04-22T08:43:08
type: Concept

Klarinett
type: Concept
narrower: Bassettklarinett