Norsk musikkvokabular: Instrumenter og ensembler
preferred label: Norsk musikkvokabular: Instrument og ensemble @nn
preferred label: Norwegian music vocabulary: Instruments and ensembles @en
type: ConceptScheme

Taegŭm
definition: Stor sideblåst bambusfløyte, ofte brukt i koreansk musikk. (Wikipedia (Engelsk), 21.04.2026)
alternative label: Daegeum
alternative label: Chŏttae
in scheme: Norsk musikkvokabular: Instrumenter og ensembler
broader: Fløyte
modified: 2026-08-09T06:00:06
created: 2026-04-21T09:33:57
type: Concept

Fløyte
type: Concept
narrower: Taegŭm