Norsk musikkvokabular: Instrumenter og ensembler
preferred label: Norsk musikkvokabular: Instrument og ensemble @nn
preferred label: Norwegian music vocabulary: Instruments and ensembles @en
type: ConceptScheme

Cimbalom
definition: Ungarsk brettsiter som spilles med hammere. Finnes i ulike varianter og størrelser. De mindre kan bæres i et snøre rundt halsen av utøveren. Større versjoner, med fire føtter, finnes også, og spenner gjerne over et større noteomfang. (Wikipedia, 15.062026)
alternative label: Tambal
alternative label: Konsertcimbalom
in scheme: Norsk musikkvokabular: Instrumenter og ensembler
broader: Dulcimer
modified: 2026-08-09T06:00:06
created: 2021-10-25T11:42:47
type: Concept

Dulcimer
type: Concept
narrower: Cimbalom