Norsk musikkvokabular: Instrument og ensemble
preferred label: Norsk musikkvokabular: Instrumenter og ensembler @nb
preferred label: Norwegian music vocabulary: Instruments and ensembles @en
type: ConceptScheme

Akustisk bassgitar
definition: Gitar i bassregisteret, med hul resonanskasse, gripebrett, og, som regel, 4 strenger. (Grove Music Online (Engelsk), 03.06.2026) @nb
alternative label: Bassgitar (akustisk) @nb
in scheme: Norsk musikkvokabular: Instrument og ensemble
broader: Bassgitar
modified: 2026-08-09T06:00:06
created: 2026-01-28T12:27:48
type: Concept

Bassgitar
type: Concept
narrower: Akustisk bassgitar