Norsk musikkvokabular: Instrument og ensemble
type: ConceptScheme
preferred label: Norsk musikkvokabular: Instrumenter og ensembler @nb
preferred label: Norwegian music vocabulary: Instruments and ensembles @en

Barokklutt
type: Concept
definition: Særlig utbredt under barokken. Har typisk 10-13 (i noen tilfeller flere) strengekor. (Wikipedia (Engelsk), 08.06.2026) @nb
in scheme: Norsk musikkvokabular: Instrument og ensemble
broader: Lutt
modified: 2026-08-09T06:00:06
created: 2026-06-08T13:04:26

Lutt
type: Concept
narrower: Barokklutt