Norsk musikkvokabular: Instrument og ensemble
type: ConceptScheme
preferred label: Norsk musikkvokabular: Instrumenter og ensembler @nb
preferred label: Norwegian music vocabulary: Instruments and ensembles @en

Luttinstrument (strykeinstrument)
type: Concept
narrower: Gambe

Gambe
type: Concept
created: 2026-06-17T13:16:48
modified: 2026-08-09T06:00:06
alternative label: Viola da gamba (gruppe av instrumenter) @nb
alternative label: Viol @nb
broader: Luttinstrument (strykeinstrument)
definition: Uspesifisert type gambe; begrep for en gruppe strykeinstrumenter som var mye i bruk på 1500-1700-tallet. Fellestrekk er gjerne tverrbånd og at instrumentene plasseres ved utøverens ben ("gamba"), men variasjoner og unntak forekommer. @nb
in scheme: Norsk musikkvokabular: Instrument og ensemble
narrower: Violone
narrower: Viola d'amore
narrower: Viola da gamba
scope note: Som en undergruppe av strykeinstrumenter blant luttinstrumentene, i henhold til definisjonen. @nb

Viola da gamba
type: Concept
broader: Gambe

Violone
type: Concept
broader: Gambe

Viola d'amore
type: Concept
broader: Gambe