Norsk musikkvokabular: Instrumenter og ensembler
type: ConceptScheme
preferred label: Norsk musikkvokabular: Instrument og ensemble @nn
preferred label: Norwegian music vocabulary: Instruments and ensembles @en

Baglamas
type: Concept
created: 2026-06-10T08:06:18
modified: 2026-08-10T06:00:06
alternative label: Baglamas (bozouki)
broader: Bouzouki
definition: En liten variant av den greske bouzoukien. Er stemt én oktav høyere og har tre strengekor. (Wikipedia, 10.06.2026)
in scheme: Norsk musikkvokabular: Instrumenter og ensembler
scope note: Må ikke forveksles med Bağlama.

Bouzouki
type: Concept
narrower: Baglamas