Norsk musikkvokabular: Instrument og ensemble
type: ConceptScheme
preferred label: Norsk musikkvokabular: Instrumenter og ensembler @nb
preferred label: Norwegian music vocabulary: Instruments and ensembles @en

Renessanselutt
type: Concept
created: 2026-06-08T13:16:23
modified: 2026-08-10T06:00:06
broader: Lutt
definition: Særlig utbredt under renessansen. Har typisk 5-12 strengekor. (Wikipedia (Engelsk), 08.06.2026) (LC Medium of Performance Thesaurus for Music (LCMPT)) @nb
in scheme: Norsk musikkvokabular: Instrument og ensemble

Lutt
type: Concept
narrower: Renessanselutt