Norsk musikkvokabular: Instrument og ensemble
type: ConceptScheme
preferred label: Norsk musikkvokabular: Instrumenter og ensembler @nb
preferred label: Norwegian music vocabulary: Instruments and ensembles @en

Siter
type: Concept
narrower: Harpeleik

Harpeleik
type: Concept
created: 2021-10-25T11:42:47
modified: 2026-08-09T06:00:06
broader: Siter
definition: Norsk akkordsiter, egnet som akkompagnerende instrument. Har historisk blitt brukt til å akkompagnere feleslåtter, og i bedehusene som akkompagnement til kristen sang. (SNL, 16.06.2026) @nb
in scheme: Norsk musikkvokabular: Instrument og ensemble