Vocabulary of types of binding
type: ConceptScheme
has top concept: Textile book
preferred label: Vokabular for innbindingstypar @nn
preferred label: Vokabular for innbindingstyper @nb

Textile book
type: Concept
created: 2026-02-17T08:21:39
alternative label: Cloth book
definition: Både omslag og ark er laget av tekstil. @nb
in scheme: Vocabulary of types of binding
preferred label: Tekstilbok @nn
top concept of: Vocabulary of types of binding