Vocabulary of types of binding
type: ConceptScheme
has top concept: Paperback
preferred label: Vokabular for innbindingstypar @nn
preferred label: Vokabular for innbindingstyper @nb

Paperback
type: Concept
created: 2026-02-17T06:13:33
alternative label: Softcover
alternative label: Perfect binding
alternative label: Paperbound
definition: Mykt omslag. Innbindingstype kan variere, men som oftest limt innbinding. Tilsvarer engelsk paperback eller softcover. Inkluderer også ryggstiftet innbinding. @nb
definition: A type of binding that glues sheets together and to a flexible outer casing to form a spine. (Kilde: RDA Official)
in scheme: Vocabulary of types of binding
preferred label: Hefta @nn
preferred label: Heftet @nb
scope note: Sheets may be folded to form gatherings. The outer casing of the volume is usually made of thin card, plastic, or some other flexible material. (Kilde: RDA Official)
top concept of: Vocabulary of types of binding